{"text_format":"1","workbook":"xlsx","n_sheets":2,"sheets":["请货管理总单","请货管理细单"],"not_rendered":{"charts":0,"images":0,"macros":0,"external_links":2,"defined_names":0,"comments":0,"pivot_tables":0},"unopened":[],"bounds":{"document_bytes":16777216,"sheet_cells":100000,"rows_first":2000,"rows_last":500,"rows_between":2000,"halvings":0,"cell_chars":16384,"cell_head_chars":4096},"cells_cut":0,"cells_raw":0,"read":"whole","date_system":"1900"}

{"sheet":"请货管理总单","index":0,"n_rows":2,"n_cols":22,"rows_kept":2,"cut":false,"hidden":false,"merged":[]}
["请货总单ID","请货日期","配送日期","门店名称","请货类型","配送级别","柜组名称","加急标志","请货人姓名","备注","请配对象ID","门店保管帐","配送中心","请配对象操作码","请货保管帐操作码","柜组ID","柜组操作码","配送中心操作码","请货人ID","最迟到货日期","配送中心ID","请货保管帐ID"]
[437360,"2016-01-29T08:58:53",null,"四川太极金带街药店","手工填写请货",2,"",0,"刘丹 ","",367,"金带街药店保管帐","太极大药房储运部","TJDYFCZJDJYD","LS-TJDYFCZJDJYD",null,"","TJDYFCYB",4121,null,305,42]

{"sheet":"请货管理细单","index":1,"n_rows":91,"n_cols":31,"rows_kept":91,"cut":false,"hidden":false,"merged":[]}
["请货细单ID","货品ID","通用名","规格","基本单位","生产厂家","产地","明细产地","请货数量","库存","45天销售","修改","使用状态","门店库存数量","细单拆分方法","是否可换货","包装大小","包装名称","配送时可销库存","最小请货数量","备注","生产厂家ID","货品操作码","请货总单ID","打印行号","大类名称","ABC分类","目录标志","必备品种","新进品种","目录品种"]
[20153138,69810,"开塞露","20ml(含甘油)","支","马应龙药业集团股份有限公司","马应龙药业","",100,{"$f":"VLOOKUP(B2,'[1]查询当前所有门店保管帐库存（后勤用）'!$G:$J,4,0)","v":7},{"$f":"VLOOKUP(B2,[2]查询时间段分门店销售明细!$E:$W,19,0)","v":13},null,"确定",null,"不足部分保留",1,600,"件",null,null,"",14115,"KSL69810",437360,null,"中西成药","B","基本目录标志","必备品种","","基本目录品种"]
[20152257,41077,"玄麦甘桔颗粒","10gx20袋","袋","太极集团四川绵阳制药有限公司","四川绵阳制药","",30,{"$f":"VLOOKUP(B3,'[1]查询当前所有门店保管帐库存（后勤用）'!$G:$J,4,0)","v":{"$error":"#N/A"}},{"$f":"VLOOKUP(B3,[2]查询时间段分门店销售明细!$E:$W,19,0)","v":72},null,"确定",null,"不足部分保留",1,60,"件",null,null,"",1415,"XMGJKL41077",437360,null,"中西成药","T3","保障目录标志","必备品种","","保障目录品种"]
[20154095,126012,"蒲地蓝消炎片","0.3g×24片x3板(薄膜衣片)","盒","云南白药集团股份有限公司","云南白药集团","",30,{"$f":"VLOOKUP(B4,'[1]查询当前所有门店保管帐库存（后勤用）'!$G:$J,4,0)","v":{"$error":"#N/A"}},{"$f":"VLOOKUP(B4,[2]查询时间段分门店销售明细!$E:$W,19,0)","v":32},null,"确定",null,"不足部分保留",1,200,"件",null,null,"",2290,"PDLXYP126012",437360,null,"中西成药","A","","必备品种","",""]
[20154323,23977,"苯磺酸氨氯地平片(压氏达)","5mgx14片","盒","北京赛科药业有限责任公司(北京第二制药厂)","北京赛科","",20,{"$f":"VLOOKUP(B5,'[1]查询当前所有门店保管帐库存（后勤用）'!$G:$J,4,0)","v":{"$error":"#N/A"}},{"$f":"VLOOKUP(B5,[2]查询时间段分门店销售明细!$E:$W,19,0)","v":28},null,"确定",null,"不足部分保留",1,240,"件",null,null,"",9525,"BHSALDPPYSD23977",437360,null,"中西成药","D","保障目录标志","必备品种","","保障目录品种"]
[20154050,28207,"四季感冒片","0.36gx12片x2板(薄膜衣)","盒","云南白药集团股份有限公司","云南白药","",20,{"$f":"VLOOKUP(B6,'[1]查询当前所有门店保管帐库存（后勤用）'!$G:$J,4,0)","v":4},{"$f":"VLOOKUP(B6,[2]查询时间段分门店销售明细!$E:$W,19,0)","v":63},null,"确定",null,"不足部分保留",1,400,"件",null,null,"",2290,"SJGMP28207",437360,null,"中西成药","A","","必备品种","",""]
[20153710,39103,"葡萄糖酸钙锌口服溶液","10mlx24支","盒","澳诺制药有限公司(原：澳诺(河北)制药有限公司)","澳诺(中国)制药","",20,{"$f":"VLOOKUP(B7,'[1]查询当前所有门店保管帐库存（后勤用）'!$G:$J,4,0)","v":18},{"$f":"VLOOKUP(B7,[2]查询时间段分门店销售明细!$E:$W,19,0)","v":35},null,"确定",null,"不足部分保留",1,60,"件",null,null,"",11841,"PTTSGXKFRY39103",437360,null,"中西成药","A","保障目录标志","必备品种","","保障目录品种"]
[20151853,43016,"阿奇霉素片","0.25gx6片x2板","盒","西南药业股份有限公司","西南药业","",20,{"$f":"VLOOKUP(B8,'[1]查询当前所有门店保管帐库存（后勤用）'!$G:$J,4,0)","v":14},{"$f":"VLOOKUP(B8,[2]查询时间段分门店销售明细!$E:$W,19,0)","v":30},null,"确定",null,"不足部分保留",1,300,"件",null,null,"",1038,"AQMSP43016",437360,null,"中西成药","T1","保障目录标志","必备品种","","保障目录品种"]
[20151648,1466,"复方熊胆薄荷含片(熊胆舒喉片)","8片x2板","盒","太极集团重庆桐君阁药厂有限公司","重庆桐君阁","",20,{"$f":"VLOOKUP(B9,'[1]查询当前所有门店保管帐库存（后勤用）'!$G:$J,4,0)","v":1},{"$f":"VLOOKUP(B9,[2]查询时间段分门店销售明细!$E:$W,19,0)","v":70},null,"确定",null,"不足部分保留",1,300,"件",null,null,"",1441,"XDSHPFFXDBHHP1466",437360,null,"中西成药","T1","保障目录标志","必备品种","","保障目录品种"]
[20153761,117372,"清肺止咳丸","0.25gx12丸x3板","盒","西藏藏医学院藏药有限公司","西藏藏医学院","",20,{"$f":"VLOOKUP(B10,'[1]查询当前所有门店保管帐库存（后勤用）'!$G:$J,4,0)","v":2},{"$f":"VLOOKUP(B10,[2]查询时间段分门店销售明细!$E:$W,19,0)","v":16},null,"确定",null,"不足部分保留",1,100,"件1",null,null,"",75411,"QFZKW117372",437360,null,"中西成药","T1","保障目录标志","必备品种","","保障目录品种"]
[20152248,1486,"感冒清片","100片(薄膜衣)","瓶","广州白云山制药股份有限公司广州白云山制药总厂","白云山总厂","",20,{"$f":"VLOOKUP(B11,'[1]查询当前所有门店保管帐库存（后勤用）'!$G:$J,4,0)","v":11},{"$f":"VLOOKUP(B11,[2]查询时间段分门店销售明细!$E:$W,19,0)","v":58},null,"确定",null,"不足部分保留",1,300,"件",null,null,"",1308,"GMQP1486",437360,null,"中西成药","D","基本目录标志","必备品种","","基本目录品种"]
[20148743,67458,"盐酸氨基葡萄糖胶囊(奥泰灵)\n","0.75gx30粒\n","盒","香港澳美制药厂","香港澳美制药\n","",20,{"$f":"VLOOKUP(B12,'[1]查询当前所有门店保管帐库存（后勤用）'!$G:$J,4,0)","v":{"$error":"#N/A"}},{"$f":"VLOOKUP(B12,[2]查询时间段分门店销售明细!$E:$W,19,0)","v":9},null,"确定",null,"不足部分保留",1,160,"件",null,null,"",4133,"YSAJPTTJNAT67458",437360,null,"中西成药","D","保障目录标志","必备品种","","保障目录品种"]
[20153709,63223,"玻璃体温计","内标式(腋下型)","支","","东阿阿胶阿华","",20,{"$f":"VLOOKUP(B13,'[1]查询当前所有门店保管帐库存（后勤用）'!$G:$J,4,0)","v":{"$error":"#N/A"}},{"$f":"VLOOKUP(B13,[2]查询时间段分门店销售明细!$E:$W,19,0)","v":20},null,"确定",null,"不足部分保留",1,600,"件",null,null,"",null,"BLTWJ63223",437360,null,"","D","","必备品种","",""]
[20152240,110737,"肠炎宁片","0.42gx12片x3板(薄膜衣)","盒","江西天施康弋阳制药有限公司","江西天施康弋阳","",20,{"$f":"VLOOKUP(B14,'[1]查询当前所有门店保管帐库存（后勤用）'!$G:$J,4,0)","v":1},{"$f":"VLOOKUP(B14,[2]查询时间段分门店销售明细!$E:$W,19,0)","v":12},null,"确定",null,"不足部分保留",1,10,"条",null,null,"",66296,"CYNP110737",437360,null,"中西成药","A","保障目录标志","必备品种","","保障目录品种"]
[20151641,96799,"精制银翘解毒片 ","15片x3板(每片含扑热息痛44mg)","盒","太极集团四川绵阳制药有限公司","四川绵阳制药","",20,{"$f":"VLOOKUP(B15,'[1]查询当前所有门店保管帐库存（后勤用）'!$G:$J,4,0)","v":{"$error":"#N/A"}},{"$f":"VLOOKUP(B15,[2]查询时间段分门店销售明细!$E:$W,19,0)","v":44},null,"确定",null,"不足部分保留",1,300,"件",null,null,"",1415,"JZYQJDP",437360,null,"中西成药","T1","基本目录标志","必备品种","","基本目录品种"]
[20154049,968,"喷昔洛韦乳膏(夫坦)","1%:10g","支","重庆华邦制药股份有限公司","重庆华邦制药","",15,{"$f":"VLOOKUP(B16,'[1]查询当前所有门店保管帐库存（后勤用）'!$G:$J,4,0)","v":{"$error":"#N/A"}},{"$f":"VLOOKUP(B16,[2]查询时间段分门店销售明细!$E:$W,19,0)","v":24},null,"确定",null,"不足部分保留",1,200,"件",null,null,"",1529,"FTRGPXLWRG968",437360,null,"中西成药","D","基本目录标志","必备品种","","基本目录品种"]
[20148747,1835,"京都念慈菴蜜炼川贝枇杷膏","150ml","瓶","香港京都念慈庵总厂有限公司","京都念慈庵","",12,{"$f":"VLOOKUP(B17,'[1]查询当前所有门店保管帐库存（后勤用）'!$G:$J,4,0)","v":5},{"$f":"VLOOKUP(B17,[2]查询时间段分门店销售明细!$E:$W,19,0)","v":16},null,"确定",null,"不足部分保留",1,72,"件",null,null,"",2278,"JDNCAMLCBPPG1835",437360,null,"中西成药","D","保障目录标志","必备品种","","保障目录品种"]
[20148744,1860,"京都念慈菴蜜炼川贝枇杷膏","300ml","瓶","香港京都念慈庵总厂有限公司","京都念慈庵","",12,{"$f":"VLOOKUP(B18,'[1]查询当前所有门店保管帐库存（后勤用）'!$G:$J,4,0)","v":3},{"$f":"VLOOKUP(B18,[2]查询时间段分门店销售明细!$E:$W,19,0)","v":11},null,"确定",null,"不足部分保留",1,48,"件",null,null,"",2278,"JDNCMLCB",437360,null,"中西成药","D","保障目录标志","必备品种","","保障目录品种"]
[20148750,1841,"通天口服液","10mlx6支","盒","太极集团重庆涪陵制药厂有限公司","重庆涪陵制药","",12,{"$f":"VLOOKUP(B19,'[1]查询当前所有门店保管帐库存（后勤用）'!$G:$J,4,0)","v":{"$error":"#N/A"}},{"$f":"VLOOKUP(B19,[2]查询时间段分门店销售明细!$E:$W,19,0)","v":1},5,"确定",null,"不足部分保留",1,84,"件",null,null,"",8211,"TTKFY1841",437360,null,"中西成药","T3","基本目录标志","必备品种","","基本目录品种"]
[20152238,496,"多酶片","100片","瓶","重庆申高生化制药有限公司(原：重庆荣高生化制药)","重庆申高生化","",10,{"$f":"VLOOKUP(B20,'[1]查询当前所有门店保管帐库存（后勤用）'!$G:$J,4,0)","v":1},{"$f":"VLOOKUP(B20,[2]查询时间段分门店销售明细!$E:$W,19,0)","v":8},null,"确定",null,"不足部分保留",1,600,"大件",null,null,"",1623,"DMP496",437360,null,"中西成药","D","基本目录标志","必备品种","","基本目录品种"]
[20152239,1472,"陈香露白露片","0.3gx100片","瓶","重庆科瑞制药有限责任公司","重庆科瑞","",10,{"$f":"VLOOKUP(B21,'[1]查询当前所有门店保管帐库存（后勤用）'!$G:$J,4,0)","v":5},{"$f":"VLOOKUP(B21,[2]查询时间段分门店销售明细!$E:$W,19,0)","v":10},5,"确定",null,"不足部分保留",1,200,"箱",null,null,"",1013,"CXLBLP1472",437360,null,"中西成药","D","保障目录标志","必备品种","","保障目录品种"]
[20151626,16185,"厄贝沙坦片(安博维)","0.15gx7片","盒","赛诺菲安万特(杭州)制药有限公司","赛诺菲(杭州)制药分装","",10,{"$f":"VLOOKUP(B22,'[1]查询当前所有门店保管帐库存（后勤用）'!$G:$J,4,0)","v":14},{"$f":"VLOOKUP(B22,[2]查询时间段分门店销售明细!$E:$W,19,0)","v":22},null,"确定",null,"不足部分保留",1,360,"箱",null,null,"",20737,"EBSTPABW16185",437360,null,"中西成药","D","保障目录标志","必备品种","","保障目录品种"]
[20152265,89023,"复合维生素片(爱乐维)","30片","盒","","阿根廷Bayer S.A.","",10,{"$f":"VLOOKUP(B23,'[1]查询当前所有门店保管帐库存（后勤用）'!$G:$J,4,0)","v":1},{"$f":"VLOOKUP(B23,[2]查询时间段分门店销售明细!$E:$W,19,0)","v":4},6,"确定",null,"不足部分保留",1,10,"件",null,null,"",null,"FHWSSPALW89023",437360,null,"","B","保障目录标志","必备品种","","保障目录品种"]
[20151635,104800,"氨麻美敏片(Ⅱ)（原美扑伪麻片）","20片","盒","中美天津史克制药有限公司","中美史克","",10,{"$f":"VLOOKUP(B24,'[1]查询当前所有门店保管帐库存（后勤用）'!$G:$J,4,0)","v":6},{"$f":"VLOOKUP(B24,[2]查询时间段分门店销售明细!$E:$W,19,0)","v":12},null,"确定",null,"不足部分保留",1,200,"件",null,null,"",2265,"AMMMP(Ⅱ)（YMPWMP）",437360,null,"中西成药","A","保障目录标志","必备品种","","保障目录品种"]
[20151851,69796,"马应龙麝香痔疮膏","20g","支","马应龙药业集团股份有限公司","马应龙药业","",10,{"$f":"VLOOKUP(B25,'[1]查询当前所有门店保管帐库存（后勤用）'!$G:$J,4,0)","v":6},{"$f":"VLOOKUP(B25,[2]查询时间段分门店销售明细!$E:$W,19,0)","v":9},5,"确定",null,"不足部分保留",1,240,"件",null,null,"",14115,"MYLSXZCG69796",437360,null,"中西成药","B","基本目录标志","必备品种","","基本目录品种"]
[20154048,43732,"痔炎消片","0.53gx10片x3板(薄膜衣)","盒","马应龙药业集团股份有限公司","马应龙药业","",10,{"$f":"VLOOKUP(B26,'[1]查询当前所有门店保管帐库存（后勤用）'!$G:$J,4,0)","v":{"$error":"#N/A"}},{"$f":"VLOOKUP(B26,[2]查询时间段分门店销售明细!$E:$W,19,0)","v":10},null,"确定",null,"不足部分保留",1,200,"件",null,null,"",14115,"ZYXP43732",437360,null,"中西成药","A","保障目录标志","必备品种","","保障目录品种"]
[20151649,75028,"铁笛片","1gx24片","盒","成都新希臣药业有限责任公司(原：成都希臣药业)","成都神鹤药业（原成都新希臣)","",10,{"$f":"VLOOKUP(B27,'[1]查询当前所有门店保管帐库存（后勤用）'!$G:$J,4,0)","v":3},{"$f":"VLOOKUP(B27,[2]查询时间段分门店销售明细!$E:$W,19,0)","v":11},null,"确定",null,"不足部分保留",1,200,"件",null,null,"",1391,"TDP75028",437360,null,"中西成药","B","保障目录标志","必备品种","","保障目录品种"]
[20152242,82530,"复方黄藤洗液","186ml(内附冲洗器)","盒","广西德联制药有限公司","广西德联制药","",10,{"$f":"VLOOKUP(B28,'[1]查询当前所有门店保管帐库存（后勤用）'!$G:$J,4,0)","v":{"$error":"#N/A"}},{"$f":"VLOOKUP(B28,[2]查询时间段分门店销售明细!$E:$W,19,0)","v":5},null,"确定",null,"不足部分保留",1,80,"件",null,null,"",21401,"FFHTXY82530",437360,null,"中西成药","A","保障目录标志","必备品种","","保障目录品种"]
[20151627,45754,"奥美拉唑肠溶胶囊","20mgx14粒","瓶","石药集团欧意药业有限公司(原:石家庄欧意药业公司)","石药集团欧意","",10,{"$f":"VLOOKUP(B29,'[1]查询当前所有门店保管帐库存（后勤用）'!$G:$J,4,0)","v":8},{"$f":"VLOOKUP(B29,[2]查询时间段分门店销售明细!$E:$W,19,0)","v":8},null,"确定",null,"不足部分保留",1,300,"件",null,null,"",1182,"AMLZCRJN45754",437360,null,"中西成药","A","基本目录标志","必备品种","","基本目录品种"]
[20151630,9411,"三金片","72片","盒","桂林三金药业股份有限公司","桂林三金药业","",10,{"$f":"VLOOKUP(B30,'[1]查询当前所有门店保管帐库存（后勤用）'!$G:$J,4,0)","v":1},{"$f":"VLOOKUP(B30,[2]查询时间段分门店销售明细!$E:$W,19,0)","v":12},null,"确定",null,"不足部分保留",1,168,"件1",null,null,"",2377,"SJP9411",437360,null,"中西成药","D","","必备品种","",""]
[20152222,132433,"复方感冒灵颗粒","14gx15袋","盒","湖南三九南开制药有限公司","华润三九（郴州）制药","",10,{"$f":"VLOOKUP(B31,'[1]查询当前所有门店保管帐库存（后勤用）'!$G:$J,4,0)","v":4},{"$f":"VLOOKUP(B31,[2]查询时间段分门店销售明细!$E:$W,19,0)","v":22},null,"确定",null,"不足部分保留",1,64,"件",null,null,"",1418,"FFGMLKL132433",437360,null,"中西成药","D","","必备品种","",""]
[20152221,106211,"风寒感冒颗粒","8gx6袋","盒","云南白药集团股份有限公司","云南白药股份","",10,{"$f":"VLOOKUP(B32,'[1]查询当前所有门店保管帐库存（后勤用）'!$G:$J,4,0)","v":{"$error":"#N/A"}},{"$f":"VLOOKUP(B32,[2]查询时间段分门店销售明细!$E:$W,19,0)","v":10},null,"确定",null,"不足部分保留",1,200,"件3",null,null,"",2290,"FHGMKL106211",437360,null,"中西成药","A","","必备品种","",""]
[20151647,55824,"健胃消食片","0.8gx8片x4板(薄膜衣片)","盒","江中药业股份有限公司","江中药业","",10,{"$f":"VLOOKUP(B33,'[1]查询当前所有门店保管帐库存（后勤用）'!$G:$J,4,0)","v":8},{"$f":"VLOOKUP(B33,[2]查询时间段分门店销售明细!$E:$W,19,0)","v":23},null,"确定",null,"不足部分保留",1,300,"件",null,null,"",16337,"JWXSP55824",437360,null,"中西成药","D","基本目录标志","必备品种","","基本目录品种"]
[20151638,82184,"维生素AD滴剂(伊可新)","30粒(1岁以上)(胶囊型)","盒","山东达因海洋生物制药股份有限公司","山东达因海洋","",10,{"$f":"VLOOKUP(B34,'[1]查询当前所有门店保管帐库存（后勤用）'!$G:$J,4,0)","v":13},{"$f":"VLOOKUP(B34,[2]查询时间段分门店销售明细!$E:$W,19,0)","v":8},null,"确定",null,"不足部分保留",1,180,"件",null,null,"",11708,"WSSADDJYKX82184",437360,null,"中西成药","D","","必备品种","",""]
[20152241,92130,"荡涤灵颗粒","20gx6袋","盒","太极集团四川绵阳制药有限公司","四川绵阳制药","",10,{"$f":"VLOOKUP(B35,'[1]查询当前所有门店保管帐库存（后勤用）'!$G:$J,4,0)","v":2},{"$f":"VLOOKUP(B35,[2]查询时间段分门店销售明细!$E:$W,19,0)","v":7},null,"确定",null,"不足部分保留",1,120,"箱",null,null,"",1415,"DDLKL92130",437360,null,"中西成药","T3","基本目录标志","必备品种","","基本目录品种"]
[20151857,118910,"黄藤素软胶囊","0.4gx12粒x2板","盒","昆明圣火制药有限责任公司","昆明圣火","",10,{"$f":"VLOOKUP(B36,'[1]查询当前所有门店保管帐库存（后勤用）'!$G:$J,4,0)","v":{"$error":"#N/A"}},{"$f":"VLOOKUP(B36,[2]查询时间段分门店销售明细!$E:$W,19,0)","v":3},null,"确定",null,"不足部分保留",1,240,"件",null,null,"",17069,"HTSRJN118910",437360,null,"中西成药","A","保障目录标志","必备品种","","保障目录品种"]
[20151632,123058,"小儿肺热咳喘口服液","10mlx8支","盒","黑龙江葵花药业股份有限公司","黑龙江葵花","",10,{"$f":"VLOOKUP(B37,'[1]查询当前所有门店保管帐库存（后勤用）'!$G:$J,4,0)","v":4},{"$f":"VLOOKUP(B37,[2]查询时间段分门店销售明细!$E:$W,19,0)","v":7},null,"确定",null,"不足部分保留",1,60,"件",null,null,"",2034,"XEFRKCKFY123058",437360,null,"中西成药","B","","必备品种","",""]
[20151625,31166,"远红外磁疗贴","7.5cmx11cmx1贴x2袋 ZS-B肩周炎","盒","山东朱氏堂医疗器械有限公司","山东朱氏堂","",10,{"$f":"VLOOKUP(B38,'[1]查询当前所有门店保管帐库存（后勤用）'!$G:$J,4,0)","v":2},{"$f":"VLOOKUP(B38,[2]查询时间段分门店销售明细!$E:$W,19,0)","v":2},null,"确定",null,"不足部分保留",1,300,"件",null,null,"",18983,"YHWCLT31166",437360,null,"","B","保障目录标志","必备品种","","保障目录品种"]
[20152245,40880,"孟鲁司特钠片(顺尔宁)","10mgx5片","盒","杭州默沙东制药有限公司","杭州默沙东","",10,{"$f":"VLOOKUP(B39,'[1]查询当前所有门店保管帐库存（后勤用）'!$G:$J,4,0)","v":5},{"$f":"VLOOKUP(B39,[2]查询时间段分门店销售明细!$E:$W,19,0)","v":7},null,"确定",null,"不足部分保留",1,300,"件",null,null,"",2855,"MLSTNPSEN40880",437360,null,"中西成药","D","保障目录标志","必备品种","","保障目录品种"]
[20151639,82179,"维生素AD滴剂(伊可新)","30粒(0-1岁)(胶囊型)","盒","山东达因海洋生物制药股份有限公司","山东达因海洋","",10,{"$f":"VLOOKUP(B40,'[1]查询当前所有门店保管帐库存（后勤用）'!$G:$J,4,0)","v":10},{"$f":"VLOOKUP(B40,[2]查询时间段分门店销售明细!$E:$W,19,0)","v":15},null,"确定",null,"不足部分保留",1,180,"件",null,null,"",11708,"WSSADDJYKX82179",437360,null,"中西成药","D","","必备品种","",""]
[20151634,1362,"咳特灵胶囊","30粒","瓶","广州白云山制药股份有限公司广州白云山制药总厂","广州白云山总厂","",10,{"$f":"VLOOKUP(B41,'[1]查询当前所有门店保管帐库存（后勤用）'!$G:$J,4,0)","v":3},{"$f":"VLOOKUP(B41,[2]查询时间段分门店销售明细!$E:$W,19,0)","v":14},null,"确定",null,"不足部分保留",1,300,"件",null,null,"",1308,"YLKTLJN1362",437360,null,"中西成药","D","基本目录标志","必备品种","","基本目录品种"]
[20152244,63464,"孟鲁司特钠咀嚼片(顺尔宁)","5mgx5片","盒","杭州默沙东制药有限公司","杭州默沙东","",10,{"$f":"VLOOKUP(B42,'[1]查询当前所有门店保管帐库存（后勤用）'!$G:$J,4,0)","v":2},{"$f":"VLOOKUP(B42,[2]查询时间段分门店销售明细!$E:$W,19,0)","v":9},null,"确定",null,"不足部分保留",1,300,"件",null,null,"",2855,"MLSTNJJP(SEN)63464",437360,null,"中西成药","D","保障目录标志","必备品种","","保障目录品种"]
[20151637,99818,"酚麻美敏片(泰诺)","20片(薄膜衣片)","盒","上海强生制药有限公司","上海强生","",10,{"$f":"VLOOKUP(B43,'[1]查询当前所有门店保管帐库存（后勤用）'!$G:$J,4,0)","v":7},{"$f":"VLOOKUP(B43,[2]查询时间段分门店销售明细!$E:$W,19,0)","v":6},null,"确定",null,"不足部分保留",1,10,"条",null,null,"",2196,"FMMMPTN99818",437360,null,"中西成药","A","保障目录标志","必备品种","","保障目录品种"]
[20151640,118954,"连花清瘟胶囊","0.35gx36粒","盒","石家庄以岭药业股份有限公司","石家庄以岭","",10,{"$f":"VLOOKUP(B44,'[1]查询当前所有门店保管帐库存（后勤用）'!$G:$J,4,0)","v":3},{"$f":"VLOOKUP(B44,[2]查询时间段分门店销售明细!$E:$W,19,0)","v":15},null,"确定",null,"不足部分保留",1,400,"件",null,null,"",7533,"LHQWJN118954",437360,null,"中西成药","B","保障目录标志","必备品种","","保障目录品种"]
[20153711,125563,"葡萄糖酸钙口服溶液","10mlx12支(含糖型)","盒","哈药集团三精制药有限公司","哈药三精制药","",10,{"$f":"VLOOKUP(B45,'[1]查询当前所有门店保管帐库存（后勤用）'!$G:$J,4,0)","v":9},{"$f":"VLOOKUP(B45,[2]查询时间段分门店销售明细!$E:$W,19,0)","v":12},null,"确定",null,"不足部分保留",1,80,"件",null,null,"",1376,"PTTSGKFRY125563",437360,null,"中西成药","D","保障目录标志","必备品种","","保障目录品种"]
[20154051,45545,"橘红颗粒","11gx10袋","盒","太极集团四川绵阳制药有限公司","四川绵阳制药","",10,{"$f":"VLOOKUP(B46,'[1]查询当前所有门店保管帐库存（后勤用）'!$G:$J,4,0)","v":11},{"$f":"VLOOKUP(B46,[2]查询时间段分门店销售明细!$E:$W,19,0)","v":31},null,"确定",null,"不足部分保留",1,150,"件",null,null,"",1415,"JHKL45545",437360,null,"中西成药","T1","基本目录标志","必备品种","","基本目录品种"]
[20152219,16571,"盐酸二甲双胍片(格华止)","0.85gx20片","盒","中美上海施贵宝制药有限公司","上海施贵宝制药","",10,{"$f":"VLOOKUP(B47,'[1]查询当前所有门店保管帐库存（后勤用）'!$G:$J,4,0)","v":{"$error":"#N/A"}},{"$f":"VLOOKUP(B47,[2]查询时间段分门店销售明细!$E:$W,19,0)","v":6},null,"确定",null,"不足部分保留",1,240,"件1",null,null,"",2416,"YSEJSGP",437360,null,"中西成药","D","保障目录标志","必备品种","","保障目录品种"]
[20153731,39048,"替米沙坦片(美卡素)","80mgx7片","盒","上海勃林格殷格翰药业有限公司","上海勃林格殷格翰","",10,{"$f":"VLOOKUP(B48,'[1]查询当前所有门店保管帐库存（后勤用）'!$G:$J,4,0)","v":1},{"$f":"VLOOKUP(B48,[2]查询时间段分门店销售明细!$E:$W,19,0)","v":13},null,"确定",null,"不足部分保留",1,1,"件",null,null,"",18160,"TMSTPMKS39048",437360,null,"中西成药","D","保障目录标志","","","保障目录品种"]
[20151636,28721,"枯草杆菌二联活菌颗粒(妈咪爱)","1gx30袋","盒","北京韩美药品有限公司","北京韩美","",10,{"$f":"VLOOKUP(B49,'[1]查询当前所有门店保管帐库存（后勤用）'!$G:$J,4,0)","v":3},{"$f":"VLOOKUP(B49,[2]查询时间段分门店销售明细!$E:$W,19,0)","v":6},null,"确定",null,"不足部分保留",1,200,"件",null,null,"",4550,"KCGJELHJKLMMA28721",437360,null,"中西成药","D","","","",""]
[20153708,110332,"兵兵冬暖宝热敷贴","6贴","盒","珠海国佳高分子新材料有限公司","珠海国佳高分子","",10,{"$f":"VLOOKUP(B50,'[1]查询当前所有门店保管帐库存（后勤用）'!$G:$J,4,0)","v":{"$error":"#N/A"}},{"$f":"VLOOKUP(B50,[2]查询时间段分门店销售明细!$E:$W,19,0)","v":11},null,"确定",null,"不足部分保留",1,200,"件",null,null,"",64118,"BBDNBRFT110332",437360,null,"","A","基本目录标志","","","基本目录品种"]
[20151631,133462,"热毒清片","12片x3板","盒","云南白药集团股份有限公司","云南白药","",10,{"$f":"VLOOKUP(B51,'[1]查询当前所有门店保管帐库存（后勤用）'!$G:$J,4,0)","v":{"$error":"#N/A"}},{"$f":"VLOOKUP(B51,[2]查询时间段分门店销售明细!$E:$W,19,0)","v":8},null,"确定",null,"不足部分保留",1,400,"件",null,null,"",2290,"RDQP133462",437360,null,"中西成药","A","","","",""]
[20148746,131591,"小儿宝泰康颗粒","4gx12袋","盒","云南白药集团股份有限公司","云南白药","",10,{"$f":"VLOOKUP(B52,'[1]查询当前所有门店保管帐库存（后勤用）'!$G:$J,4,0)","v":{"$error":"#N/A"}},{"$f":"VLOOKUP(B52,[2]查询时间段分门店销售明细!$E:$W,19,0)","v":5},null,"确定",null,"不足部分保留",1,100,"件",null,null,"",2290,"XEBTKKL131591",437360,null,"中西成药","A","","","",""]
[20154121,43148,"多索茶碱胶囊(凯宝川苧)","0.2gx10粒","盒","上海凯宝药业有限公司","上海凯宝","",10,{"$f":"VLOOKUP(B53,'[1]查询当前所有门店保管帐库存（后勤用）'!$G:$J,4,0)","v":2},{"$f":"VLOOKUP(B53,[2]查询时间段分门店销售明细!$E:$W,19,0)","v":7},null,"确定",null,"不足部分保留",1,120,"件",null,null,"",21620,"DSCJJNKBCN43148",437360,null,"中西成药","D","","","",""]
[20151646,84718,"丁细牙痛胶囊","0.45gx24粒","盒","深圳市泰康制药有限公司","深圳市泰康","",10,{"$f":"VLOOKUP(B54,'[1]查询当前所有门店保管帐库存（后勤用）'!$G:$J,4,0)","v":{"$error":"#N/A"}},{"$f":"VLOOKUP(B54,[2]查询时间段分门店销售明细!$E:$W,19,0)","v":9},null,"确定",null,"不足部分保留",1,1,"件",null,null,"",20164,"DXYTJN84718",437360,null,"中西成药","A","","","",""]
[20154054,105008,"复方紫草油","30ml","盒","武汉健民集团随州药业有限公司","武汉健民随州","",10,{"$f":"VLOOKUP(B55,'[1]查询当前所有门店保管帐库存（后勤用）'!$G:$J,4,0)","v":6},{"$f":"VLOOKUP(B55,[2]查询时间段分门店销售明细!$E:$W,19,0)","v":7},5,"确定",null,"不足部分保留",1,160,"件",null,null,"",1258,"FFZCY105008",437360,null,"中西成药","D","","","",""]
[20148745,40014,"马来酸氨氯地平片(普罗新希)","5mgx10片","盒","四川巴中普瑞制药有限公司","四川巴中普瑞","",10,{"$f":"VLOOKUP(B56,'[1]查询当前所有门店保管帐库存（后勤用）'!$G:$J,4,0)","v":7},{"$f":"VLOOKUP(B56,[2]查询时间段分门店销售明细!$E:$W,19,0)","v":20},null,"确定",null,"不足部分保留",1,480,"件",null,null,"",19387,"MLSALDPPPLXX40014",437360,null,"中西成药","D","保障目录标志","","","保障目录品种"]
[20154055,47732,"阿仑膦酸钠片(福善美)","70mgx1片","盒","杭州默沙东制药有限公司","杭州默沙东","",10,{"$f":"VLOOKUP(B57,'[1]查询当前所有门店保管帐库存（后勤用）'!$G:$J,4,0)","v":2},{"$f":"VLOOKUP(B57,[2]查询时间段分门店销售明细!$E:$W,19,0)","v":4},null,"确定",null,"不足部分保留",1,300,"件",null,null,"",2855,"ALLSNPFSM47732",437360,null,"中西成药","D","保障目录标志","","","保障目录品种"]
[20151858,1636,"痰咳净散","6g","盒","广州王老吉药业股份有限公司","广州王老吉","",10,{"$f":"VLOOKUP(B58,'[1]查询当前所有门店保管帐库存（后勤用）'!$G:$J,4,0)","v":{"$error":"#N/A"}},{"$f":"VLOOKUP(B58,[2]查询时间段分门店销售明细!$E:$W,19,0)","v":18},null,"确定",null,"不足部分保留",1,300,"件",null,null,"",1230,"TKJS",437360,null,"中西成药","D","保障目录标志","","","保障目录品种"]
[20152226,587,"左炔诺孕酮片(毓婷)","0.75mgx2片","盒","北京紫竹药业有限公司","北京紫竹","",10,{"$f":"VLOOKUP(B59,'[1]查询当前所有门店保管帐库存（后勤用）'!$G:$J,4,0)","v":{"$error":"#N/A"}},{"$f":"VLOOKUP(B59,[2]查询时间段分门店销售明细!$E:$W,19,0)","v":13},null,"确定",null,"不足部分保留",1,500,"件",null,null,"",1235,"YTZQNYTP587",437360,null,"中西成药","D","基本目录标志","","","基本目录品种"]
[20152247,29059,"沙美特罗替卡松粉吸入剂(舒利迭)","50ug:100ugx60吸(含准纳器)","盒","Glaxo Wellcome Operations 英国","英国","",5,{"$f":"VLOOKUP(B60,'[1]查询当前所有门店保管帐库存（后勤用）'!$G:$J,4,0)","v":{"$error":"#N/A"}},{"$f":"VLOOKUP(B60,[2]查询时间段分门店销售明细!$E:$W,19,0)","v":2},null,"确定",null,"不足部分保留",1,1,"件",null,null,"",17986,"SMTLTKSFXRJSLD29059",437360,null,"中西成药","D","基本目录标志","","","基本目录品种"]
[20148748,136433,"六味地黄丸","360丸(浓缩丸)","瓶","九芝堂股份有限公司(湖南九芝堂股份有限公司)","九芝堂股份","",5,{"$f":"VLOOKUP(B61,'[1]查询当前所有门店保管帐库存（后勤用）'!$G:$J,4,0)","v":{"$error":"#N/A"}},{"$f":"VLOOKUP(B61,[2]查询时间段分门店销售明细!$E:$W,19,0)","v":2},null,"确定",null,"不足部分保留",1,120,"件",null,null,"",1275,"LWDHW136433",437360,null,"中西成药","D","","","",""]
[20151644,1240,"辛夷鼻炎丸","30g","瓶","广州中一药业有限公司","广州白云山中一药业有限公司","",5,{"$f":"VLOOKUP(B62,'[1]查询当前所有门店保管帐库存（后勤用）'!$G:$J,4,0)","v":{"$error":"#N/A"}},{"$f":"VLOOKUP(B62,[2]查询时间段分门店销售明细!$E:$W,19,0)","v":8},null,"确定",null,"不足部分保留",1,200,"件",null,null,"",1215,"XYBYW1240",437360,null,"中西成药","D","保障目录标志","","","保障目录品种"]
[20151645,10594,"珍黄丸","12丸","盒","广西玉林制药有限责任公司","广西玉林制药","",5,{"$f":"VLOOKUP(B63,'[1]查询当前所有门店保管帐库存（后勤用）'!$G:$J,4,0)","v":{"$error":"#N/A"}},{"$f":"VLOOKUP(B63,[2]查询时间段分门店销售明细!$E:$W,19,0)","v":3},null,"确定",null,"不足部分保留",1,200,"件",null,null,"",1974,"ZHW10594",437360,null,"中西成药","D","","","",""]
[20148749,38070,"美国水晶甘油","100g","盒","南阳市广寿保健品有限责任公司","南阳广寿","",5,{"$f":"VLOOKUP(B64,'[1]查询当前所有门店保管帐库存（后勤用）'!$G:$J,4,0)","v":{"$error":"#N/A"}},{"$f":"VLOOKUP(B64,[2]查询时间段分门店销售明细!$E:$W,19,0)","v":{"$error":"#N/A"}},null,"确定",null,"不足部分保留",1,200,"件",null,null,"",1176,"MGSJGY38070",437360,null,"","D","","必备品种","",""]
[20151642,39999,"桑姜感冒胶囊","0.25gx24粒","盒","四川好医生制药有限公司","四川好医生","",5,{"$f":"VLOOKUP(B65,'[1]查询当前所有门店保管帐库存（后勤用）'!$G:$J,4,0)","v":{"$error":"#N/A"}},{"$f":"VLOOKUP(B65,[2]查询时间段分门店销售明细!$E:$W,19,0)","v":{"$error":"#N/A"}},null,"确定",null,"不足部分保留",1,240,"件",null,null,"",9766,"SJGMJN39999",437360,null,"中西成药","A","基本目录标志","必备品种","","基本目录品种"]
[20152218,17023,"盐酸二甲双胍片(格华止)","500mgx20片","盒","中美上海施贵宝制药有限公司","上海施贵宝","",5,{"$f":"VLOOKUP(B66,'[1]查询当前所有门店保管帐库存（后勤用）'!$G:$J,4,0)","v":2},{"$f":"VLOOKUP(B66,[2]查询时间段分门店销售明细!$E:$W,19,0)","v":{"$error":"#N/A"}},null,"确定",null,"不足部分保留",1,360,"件1",null,null,"",2416,"YSEJSGP",437360,null,"中西成药","D","保障目录标志","必备品种","","保障目录品种"]
[20148752,86999,"黑苦荞全株茶(三匠)","120g(5gx24袋)","盒","","四川三匠(原：西昌三匠苦荞)","",5,{"$f":"VLOOKUP(B67,'[1]查询当前所有门店保管帐库存（后勤用）'!$G:$J,4,0)","v":{"$error":"#N/A"}},{"$f":"VLOOKUP(B67,[2]查询时间段分门店销售明细!$E:$W,19,0)","v":2},null,"确定",null,"不足部分保留",1,72,"件",null,null,"",83883,"HKQQZCSJ86999",437360,null,"","D","","必备品种","新进品种",""]
[20148753,91451,"黑苦荞全胚芽茶","120g(5gx24小袋)","盒","","四川三匠(原：西昌三匠苦荞)","",5,{"$f":"VLOOKUP(B68,'[1]查询当前所有门店保管帐库存（后勤用）'!$G:$J,4,0)","v":{"$error":"#N/A"}},{"$f":"VLOOKUP(B68,[2]查询时间段分门店销售明细!$E:$W,19,0)","v":6},null,"确定",null,"不足部分保留",1,24,"件",null,null,"",83883,"HKQQPYC91451",437360,null,"","D","","必备品种","新进品种",""]
[20151628,11424,"金匮肾气丸","360粒","盒","北京同仁堂科技发展股份有限公司制药厂","北京同仁堂","",5,{"$f":"VLOOKUP(B69,'[1]查询当前所有门店保管帐库存（后勤用）'!$G:$J,4,0)","v":{"$error":"#N/A"}},{"$f":"VLOOKUP(B69,[2]查询时间段分门店销售明细!$E:$W,19,0)","v":2},null,"确定",null,"不足部分保留",1,100,"件",null,null,"",6349,"JKSQW11424",437360,null,"中西成药","D","保障目录标志","必备品种","","保障目录品种"]
[20148742,35237,"缬沙坦胶囊(托平)","80mgx7粒","盒","天大药业(珠海)有限公司","天大药业","",5,{"$f":"VLOOKUP(B70,'[1]查询当前所有门店保管帐库存（后勤用）'!$G:$J,4,0)","v":{"$error":"#N/A"}},{"$f":"VLOOKUP(B70,[2]查询时间段分门店销售明细!$E:$W,19,0)","v":6},null,"确定",null,"不足部分保留",1,200,"件",null,null,"",15099,"JSTJNTP35253",437360,null,"中西成药","D","保障目录标志","","","保障目录品种"]
[20153736,42101,"通宣理肺丸","7gx12袋(水蜜丸)","盒","太极集团四川绵阳制药有限公司","四川绵阳制药","",5,{"$f":"VLOOKUP(B71,'[1]查询当前所有门店保管帐库存（后勤用）'!$G:$J,4,0)","v":{"$error":"#N/A"}},{"$f":"VLOOKUP(B71,[2]查询时间段分门店销售明细!$E:$W,19,0)","v":4},null,"确定",null,"不足部分保留",1,150,"件",null,null,"",1415,"TXLFW42101",437360,null,"中西成药","T1","基本目录标志","必备品种","","基本目录品种"]
[20152225,11490,"复方门冬维甘滴眼液(新乐敦)","13ml","瓶","曼秀雷敦(中国)药业有限公司","曼秀雷敦","",5,{"$f":"VLOOKUP(B72,'[1]查询当前所有门店保管帐库存（后勤用）'!$G:$J,4,0)","v":{"$error":"#N/A"}},{"$f":"VLOOKUP(B72,[2]查询时间段分门店销售明细!$E:$W,19,0)","v":10},null,"确定",null,"不足部分保留",1,864,"件",null,null,"",2348,"FFMDWGDYYXLD11490",437360,null,"中西成药","D","基本目录标志","必备品种","","基本目录品种"]
[20151650,31227,"复方硫酸软骨素滴眼液(润洁)","10ml(蓝)","盒","山东博士伦福瑞达制药有限公司(山东正大福瑞达公司","博士伦福瑞达","",5,{"$f":"VLOOKUP(B73,'[1]查询当前所有门店保管帐库存（后勤用）'!$G:$J,4,0)","v":{"$error":"#N/A"}},{"$f":"VLOOKUP(B73,[2]查询时间段分门店销售明细!$E:$W,19,0)","v":5},null,"确定",null,"不足部分保留",1,600,"件",null,null,"",2147,"FFLSRGSDYYRJ31227",437360,null,"中西成药","D","","必备品种","",""]
[20151643,126909,"鼻炎康片","0.37gx150片(薄膜衣)","瓶","佛山德众药业有限公司","佛山德众","",5,{"$f":"VLOOKUP(B74,'[1]查询当前所有门店保管帐库存（后勤用）'!$G:$J,4,0)","v":1},{"$f":"VLOOKUP(B74,[2]查询时间段分门店销售明细!$E:$W,19,0)","v":6},null,"确定",null,"不足部分保留",1,100,"件",null,null,"",1589,"BYKP126909",437360,null,"中西成药","D","","","",""]
[20148751,136484,"枸橼酸西地那非片(金戈)","50mgx2片","盒","广州白云山制药股份有限公司广州白云山制药总厂","广州白云山总厂","",5,{"$f":"VLOOKUP(B75,'[1]查询当前所有门店保管帐库存（后勤用）'!$G:$J,4,0)","v":{"$error":"#N/A"}},{"$f":"VLOOKUP(B75,[2]查询时间段分门店销售明细!$E:$W,19,0)","v":3},null,"确定",null,"不足部分保留",1,200,"件",null,null,"",1308,"JYSXDNFPJG136484",437360,null,"中西成药","B","","","",""]
[20152223,135320,"桂林西瓜霜","3.5g","盒","桂林三金药业股份有限公司","桂林三金","",5,{"$f":"VLOOKUP(B76,'[1]查询当前所有门店保管帐库存（后勤用）'!$G:$J,4,0)","v":1},{"$f":"VLOOKUP(B76,[2]查询时间段分门店销售明细!$E:$W,19,0)","v":1},null,"确定",null,"不足部分保留",1,360,"件",null,null,"",2377,"GLXGS135320",437360,null,"中西成药","D","","必备品种","",""]
[20151633,119226,"小儿清肺化痰颗粒","6gx18袋","盒","神威药业有限公司","神威药业","",5,{"$f":"VLOOKUP(B77,'[1]查询当前所有门店保管帐库存（后勤用）'!$G:$J,4,0)","v":8},{"$f":"VLOOKUP(B77,[2]查询时间段分门店销售明细!$E:$W,19,0)","v":12},null,"确定",null,"不足部分保留",1,80,"件",null,null,"",1385,"XEQFHTKL119226",437360,null,"中西成药","D","","必备品种","",""]
[20152246,29060,"沙美特罗替卡松粉吸入剂(舒利迭)","50ug:250ugx60喷(含准纳器)","盒","Glaxo Operations UK Limited(英国)","英国","",3,{"$f":"VLOOKUP(B78,'[1]查询当前所有门店保管帐库存（后勤用）'!$G:$J,4,0)","v":1},{"$f":"VLOOKUP(B78,[2]查询时间段分门店销售明细!$E:$W,19,0)","v":3},null,"确定",null,"不足部分保留",1,20,"大件",null,null,"",69318,"SMTLTKSFXRJSLD29060",437360,null,"中西成药","D","基本目录标志","","","基本目录品种"]
[20151855,96539,"雷贝拉唑钠肠溶胶囊","10mgx7粒","盒","江苏济川制药有限公司","江苏济川","",3,{"$f":"VLOOKUP(B79,'[1]查询当前所有门店保管帐库存（后勤用）'!$G:$J,4,0)","v":{"$error":"#N/A"}},{"$f":"VLOOKUP(B79,[2]查询时间段分门店销售明细!$E:$W,19,0)","v":{"$error":"#N/A"}},null,"确定",null,"不足部分保留",1,240,"件",null,null,"",8201,"LBLZCRJN96539",437360,null,"中西成药","D","","","",""]
[20151854,35240,"雷贝拉唑钠肠溶片","20mgx7片","盒","成都迪康制药有限公司","成都迪康","",3,{"$f":"VLOOKUP(B80,'[1]查询当前所有门店保管帐库存（后勤用）'!$G:$J,4,0)","v":{"$error":"#N/A"}},{"$f":"VLOOKUP(B80,[2]查询时间段分门店销售明细!$E:$W,19,0)","v":{"$error":"#N/A"}},null,"确定",null,"不足部分保留",1,1,"件",null,null,"",2261,"LBLZNCRP35240",437360,null,"中西成药","D","保障目录标志","必备品种","","保障目录品种"]
{"$rows_left_out":11}